Reaction Details
TargetLysosomal alpha-glucosidase
LigandBDBM50398032
Substrate/Competitorn/a
Meas. Tech.ChEMBL_873176 (CHEMBL2183407)
IC50 940±n/a nM
Citation Xiao, JWestbroek, WMotabar, OLea, WAHu, XVelayati, AZheng, WSouthall, NGustafson, AMGoldin, ESidransky, ELiu, KSimeonov, ATamargo, RJRibes, AMatalonga, LFerrer, MMarugan, JJ Discovery of a novel noniminosugar acida glucosidase chaperone series. J Med Chem55:7546-59 (2012) 
 
Lysosomal alpha-glucosidase
Name:Lysosomal alpha-glucosidase
Type:PROTEIN
Mol. Mass.:105312.45
Organism:Homo sapiens (Human)
Description:ChEMBL_1506060
Residue:952
BDBM50398032
NameBDBM50398032
Synonyms:CHEMBL1603014
TypeSmall organic molecule
Emp. Form.C20H21N3O4S
Mol. Mass.399.463
SMILESCC(=O)c1ccc(cc1)N1CCN(CC1)S(=O)(=O)c1ccc2NC(=O)Cc2c1