Reaction Details
TargetLeucine-rich repeat serine/threonine-protein kinase 2
LigandBDBM50398662
Substrate/Competitorn/a
Meas. Tech.ChEMBL_874767 (CHEMBL2188381)
IC50 10±n/a nM
Citation Estrada, AALiu, XBaker-Glenn, CBeresford, ABurdick, DJChambers, MChan, BKChen, HDing, XDiPasquale, AGDominguez, SLDotson, JDrummond, JFlagella, MFlynn, SFuji, RGill, AGunzner-Toste, JHarris, SFHeffron, TPKleinheinz, TLee, DWLe Pichon, CELyssikatos, JPMedhurst, ADMoffat, JGMukund, SNash, KScearce-Levie, KSheng, ZShore, DGTran, TTrivedi, NWang, SZhang, SZhang, XZhao, GZhu, HSweeney, ZK Discovery of highly potent, selective, and brain-penetrable leucine-rich repeat kinase 2 (LRRK2) small molecule inhibitors. J Med Chem55:9416-33 (2012) 
 
Leucine-rich repeat serine/threonine-protein kinase 2
Name:Leucine-rich repeat serine/threonine-protein kinase 2
Type:Protein
Mol. Mass.:286113.20
Organism:Homo sapiens (Human)
Description:Q5S007
Residue:2527
BDBM50398662
NameBDBM50398662
Synonyms:CHEMBL2178140
TypeSmall organic molecule
Emp. Form.C19H23F4N5O3
Mol. Mass.445.4112
SMILESCCNc1nc(Nc2cc(F)c(cc2OC)C(=O)NCC(C)(C)O)ncc1C(F)(F)F