Reaction Details
TargetBeta-secretase 1
LigandBDBM50398683
Substrate/Competitorn/a
Meas. Tech.ChEMBL_874985 (CHEMBL2183861)
Ki 1±n/a nM
Citation Mandal, MZhu, ZCumming, JNLiu, XStrickland, CMazzola, RDCaldwell, JPLeach, PGrzelak, MHyde, LZhang, QTerracina, GZhang, LChen, XKuvelkar, RKennedy, MEFavreau, LCox, KOrth, PBuevich, AVoigt, JWang, HKazakevich, IMcKittrick, BAGreenlee, WParker, EMStamford, AW Design and validation of bicyclic iminopyrimidinones as beta amyloid cleaving enzyme-1 (BACE1) inhibitors: conformational constraint to favor a bioactive conformation. J Med Chem55:9331-45 (2012) 
 
Beta-secretase 1
Name:Beta-secretase 1
Type:Protein
Mol. Mass.:55755.10
Organism:Homo sapiens (Human)
Description:P56817
Residue:501
BDBM50398683
NameBDBM50398683
Synonyms:CHEMBL2178147
TypeSmall organic molecule
Emp. Form.C26H22FN5O2S
Mol. Mass.487.549
SMILESCC#Cc1cncc(c1)-c1csc(c1)[C@]12CN(C[C@H]1C(=O)N(C)C(N)=N2)C(=O)c1cccc(F)c1