Reaction Details
TargetBeta-secretase 1
LigandBDBM50398693
Substrate/Competitorn/a
Meas. Tech.ChEMBL_874985 (CHEMBL2183861)
Ki 4±n/a nM
Citation Mandal, MZhu, ZCumming, JNLiu, XStrickland, CMazzola, RDCaldwell, JPLeach, PGrzelak, MHyde, LZhang, QTerracina, GZhang, LChen, XKuvelkar, RKennedy, MEFavreau, LCox, KOrth, PBuevich, AVoigt, JWang, HKazakevich, IMcKittrick, BAGreenlee, WParker, EMStamford, AW Design and validation of bicyclic iminopyrimidinones as beta amyloid cleaving enzyme-1 (BACE1) inhibitors: conformational constraint to favor a bioactive conformation. J Med Chem55:9331-45 (2012) 
 
Beta-secretase 1
Name:Beta-secretase 1
Type:Protein
Mol. Mass.:55755.10
Organism:Homo sapiens (Human)
Description:P56817
Residue:501
BDBM50398693
NameBDBM50398693
Synonyms:CHEMBL2178718
TypeSmall organic molecule
Emp. Form.C22H18FN7OS
Mol. Mass.447.488
SMILESCN1C(N)=N[C@]2(CN(C[C@H]2C1=O)c1ncc(F)cn1)c1cc(cs1)-c1cccc(c1)C#N