Reaction Details
TargetDual specificity calcium/calmodulin-dependent 3',5'-cyclic nucleotide phosphodiesterase 1C
LigandBDBM50398789
Substrate/Competitorn/a
Meas. Tech.ChEMBL_873308 (CHEMBL2185161)
IC50>1000±n/a nM
Citation Claffey, MMHelal, CJVerhoest, PRKang, ZFors, KSJung, SZhong, JBundesmann, MWHou, XLui, SKleiman, RJVanase-Frawley, MSchmidt, AWMenniti, FSchmidt, CJHoffman, WEHajos, MMcDowell, LO'Connor, REMacdougall-Murphy, MFonseca, KRBecker, SLNelson, FRLiras, S Application of structure-based drug design and parallel chemistry to identify selective, brain penetrant, in vivo active phosphodiesterase 9A inhibitors. J Med Chem55:9055-68 (2012) 
 
Dual specificity calcium/calmodulin-dependent 3',5'-cyclic nucleotide phosphodiesterase 1C
Name:Dual specificity calcium/calmodulin-dependent 3',5'-cyclic nucleotide phosphodiesterase 1C
Type:Enzyme
Mol. Mass.:80778.58
Organism:Homo sapiens (Human)
Description:Q14123
Residue:709
BDBM50398789
NameBDBM50398789
Synonyms:CHEMBL2180073
TypeSmall organic molecule
Emp. Form.C21H25N5O3
Mol. Mass.395.4549
SMILESC[C@@H](N1CC(C1)Oc1ccccc1)c1nc2n(ncc2c(=O)[nH]1)C1CCOCC1