Reaction Details
TargetCOUP transcription factor 1
LigandBDBM50399676
Substrate/Competitorn/a
Meas. Tech.ChEMBL_876574 (CHEMBL2188531)
IC50>10000±n/a nM
Citation Yang, JWang, LJLiu, JJZhong, LZheng, RLXu, YJi, PZhang, CHWang, WJLin, XDLi, LLWei, YQYang, SY Structural optimization and structure-activity relationships of N2-(4-(4-Methylpiperazin-1-yl)phenyl)-N8-phenyl-9H-purine-2,8-diamine derivatives, a new class of reversible kinase inhibitors targeting both EGFR-activating and resistance mutations. J Med Chem55:10685-99 (2012) 
 
COUP transcription factor 1
Name:COUP transcription factor 1
Type:PROTEIN
Mol. Mass.:46167.74
Organism:Homo sapiens (Human)
Description:ChEMBL_876574
Residue:423
BDBM50399676
NameBDBM50399676
Synonyms:CHEMBL2178352 | US9096601, 8-26
TypeSmall organic molecule
Emp. Form.C27H32N8
Mol. Mass.468.5966
SMILESCN1CCN(CC1)c1ccc(Nc2ncc3nc(Nc4ccccc4)n(C4CCCC4)c3n2)cc1