Reaction Details
TargetVoltage-dependent N-type calcium channel subunit alpha-1B
LigandBDBM50400587
Substrate/Competitorn/a
Meas. Tech.ChEMBL_880021 (CHEMBL2212933)
EC50>1000000±n/a nM
Citation Liang, MTarr, TBBravo-Altamirano, KValdomir, GRensch, GSwanson, LDeStefino, NRMazzarisi, CMOlszewski, RAWilson, GMMeriney, SDWipf, P Synthesis and biological evaluation of a selective N- and p/q-type calcium channel agonist. ACS Med Chem Lett3:985-990 (2012) 
 
Voltage-dependent N-type calcium channel subunit alpha-1B
Name:Voltage-dependent N-type calcium channel subunit alpha-1B
Type:Enzyme
Mol. Mass.:262548.16
Organism:Homo sapiens (Human)
Description:Q00975
Residue:2339
BDBM50400587
NameBDBM50400587
Synonyms:CHEMBL2206257
TypeSmall organic molecule
Emp. Form.C26H32N6O
Mol. Mass.444.5719
SMILESCC[C@H](CO)Nc1nc(N(Cc2ccccc2)Cc2ccccc2)c2ncn(C(C)C)c2n1