Reaction Details
TargetMacrophage colony-stimulating factor 1 receptor
LigandBDBM50400606
Substrate/Competitorn/a
Meas. Tech.ChEMBL_880068 (CHEMBL2213417)
IC50 64.4±n/a nM
Citation Liu, GCampbell, BTHolladay, MWFord Pulido, JMHua, HGitnick, DGardner, MFJames, JBreider, MABrigham, DBelli, BArmstrong, RCTreiber, DK Discovery of AC710, a Globally Selective Inhibitor of Platelet-Derived Growth Factor Receptor-Family Kinases. ACS Med Chem Lett3:997-1002 (2012) 
 
Macrophage colony-stimulating factor 1 receptor
Name:Macrophage colony-stimulating factor 1 receptor
Type:Protein
Mol. Mass.:109173.45
Organism:Mus musculus (Mouse)
Description:P09581
Residue:977
BDBM50400606
NameBDBM50400606
Synonyms:CHEMBL2203437
TypeSmall organic molecule
Emp. Form.C29H38N6O4
Mol. Mass.534.6498
SMILESCC(C)(C)N1CCC(CC1)Oc1ccc(nc1)C(=O)Nc1ccc(NC(=O)Nc2cc(on2)C(C)(C)C)cc1