Reaction Details
TargetHistamine H3 receptor
LigandBDBM50401003
Substrate/Competitorn/a
Meas. Tech.ChEMBL_879384 (CHEMBL2208782)
Ki 8.9±n/a nM
Citation Wager, TTPettersen, BASchmidt, AWSpracklin, DKMente, SButler, TWHoward, HLettiere, DJRubitski, DMWong, DFNedza, FMNelson, FRRollema, HRaggon, JWAubrecht, JFreeman, JKMarcek, JMCianfrogna, JCook, KWJames, LCChatman, LAIredale, PABanker, MJHomiski, MLMunzner, JBChandrasekaran, RY Discovery of two clinical histamine H(3) receptor antagonists: trans-N-ethyl-3-fluoro-3-[3-fluoro-4-(pyrrolidinylmethyl)phenyl]cyclobutanecarboxamide (PF-03654746) and trans-3-fluoro-3-[3-fluoro-4-(pyrrolidin-1-ylmethyl)phenyl]-N-(2-methylpropyl)cyclobutanecarboxamide (PF-03654764). J Med Chem54:7602-20 (2011) 
 
Histamine H3 receptor
Name:Histamine H3 receptor
Type:G Protein-Coupled Receptor (GPCR)
Mol. Mass.:48607.98
Organism:Rattus norvegicus (rat)
Description:n/a
Residue:445
BDBM50401003
NameBDBM50401003
Synonyms:CHEMBL2151197
TypeSmall organic molecule
Emp. Form.C18H24F2N2O
Mol. Mass.322.3928
SMILESCCNC(=O)[C@H]1C[C@](F)(C1)c1ccc(CN2CCCC2)c(F)c1