Reaction Details
TargetHistamine H3 receptor
LigandBDBM50401005
Substrate/Competitorn/a
Meas. Tech.ChEMBL_879382 (CHEMBL2208780)
Ki 160±n/a nM
Citation Wager, TTPettersen, BASchmidt, AWSpracklin, DKMente, SButler, TWHoward, HLettiere, DJRubitski, DMWong, DFNedza, FMNelson, FRRollema, HRaggon, JWAubrecht, JFreeman, JKMarcek, JMCianfrogna, JCook, KWJames, LCChatman, LAIredale, PABanker, MJHomiski, MLMunzner, JBChandrasekaran, RY Discovery of two clinical histamine H(3) receptor antagonists: trans-N-ethyl-3-fluoro-3-[3-fluoro-4-(pyrrolidinylmethyl)phenyl]cyclobutanecarboxamide (PF-03654746) and trans-3-fluoro-3-[3-fluoro-4-(pyrrolidin-1-ylmethyl)phenyl]-N-(2-methylpropyl)cyclobutanecarboxamide (PF-03654764). J Med Chem54:7602-20 (2011) 
 
Histamine H3 receptor
Name:Histamine H3 receptor
Type:G Protein-Coupled Receptor (GPCR)
Mol. Mass.:48607.98
Organism:Rattus norvegicus (rat)
Description:n/a
Residue:445
BDBM50401005
NameBDBM50401005
Synonyms:CHEMBL2206290
TypeSmall organic molecule
Emp. Form.C19H27ClN2O
Mol. Mass.334.883
SMILESCN(C[C@H]1C[C@@H](C1)c1ccc(CN2CCCC2)c(Cl)c1)C(C)=O