Reaction Details
TargetE3 ubiquitin-protein ligase XIAP
LigandBDBM50401482
Substrate/Competitorn/a
Meas. Tech.ChEMBL_884121 (CHEMBL2216051)
IC50 8.4±n/a nM
Citation Lecis, DMastrangelo, EBelvisi, LBolognesi, MCivera, MCossu, FDe Cesare, MDelia, DDrago, CManenti, GManzoni, LMilani, MMoroni, EPerego, PPotenza, DRizzo, VScavullo, CScolastico, CServida, FVasile, FSeneci, P Dimeric Smac mimetics/IAP inhibitors as in vivo-active pro-apoptotic agents. Part II: Structural and biological characterization. Bioorg Med Chem20:6709-23 (2012) 
 
E3 ubiquitin-protein ligase XIAP
Name:E3 ubiquitin-protein ligase XIAP
Type:Protein
Mol. Mass.:56685.27
Organism:Homo sapiens (Human)
Description:P98170
Residue:497
BDBM50401482
NameBDBM50401482
Synonyms:CHEMBL2204573
TypeSmall organic molecule
Emp. Form.C63H80N12O7
Mol. Mass.1117.3855
SMILESCC[C@H](NC)C(=O)N[C@H]1[C@@H](CNC(=O)CCc2cn(C[C@H]3CC[C@H]4CC[C@H](N4C(=O)[C@H]3NC(=O)[C@H](CC)NC)C(=O)NC(c3ccccc3)c3ccccc3)nn2)CC[C@H]2CC[C@H](N2C1=O)C(=O)NC(c1ccccc1)c1ccccc1