Reaction Details
TargetE3 ubiquitin-protein ligase XIAP
LigandBDBM50401485
Substrate/Competitorn/a
Meas. Tech.ChEMBL_884121 (CHEMBL2216051)
IC50 15.5±n/a nM
Citation Lecis, DMastrangelo, EBelvisi, LBolognesi, MCivera, MCossu, FDe Cesare, MDelia, DDrago, CManenti, GManzoni, LMilani, MMoroni, EPerego, PPotenza, DRizzo, VScavullo, CScolastico, CServida, FVasile, FSeneci, P Dimeric Smac mimetics/IAP inhibitors as in vivo-active pro-apoptotic agents. Part II: Structural and biological characterization. Bioorg Med Chem20:6709-23 (2012) 
 
E3 ubiquitin-protein ligase XIAP
Name:E3 ubiquitin-protein ligase XIAP
Type:Protein
Mol. Mass.:56685.27
Organism:Homo sapiens (Human)
Description:P98170
Residue:497
BDBM50401485
NameBDBM50401485
Synonyms:CHEMBL2204576
TypeSmall organic molecule
Emp. Form.C66H88N10O11
Mol. Mass.1197.4653
SMILESCC[C@H](NC)C(=O)N[C@H]1[C@@H](CNC(=O)COCCOCCOCC(=O)NC[C@H]2CC[C@H]3CC[C@H](N3C(=O)[C@H]2NC(=O)[C@H](CC)NC)C(=O)NC(c2ccccc2)c2ccccc2)CC[C@H]2CC[C@H](N2C1=O)C(=O)NC(c1ccccc1)c1ccccc1