Reaction Details
TargetE3 ubiquitin-protein ligase XIAP
LigandBDBM50401489
Substrate/Competitorn/a
Meas. Tech.ChEMBL_884123 (CHEMBL2216053)
IC50 37.5±n/a nM
Citation Lecis, DMastrangelo, EBelvisi, LBolognesi, MCivera, MCossu, FDe Cesare, MDelia, DDrago, CManenti, GManzoni, LMilani, MMoroni, EPerego, PPotenza, DRizzo, VScavullo, CScolastico, CServida, FVasile, FSeneci, P Dimeric Smac mimetics/IAP inhibitors as in vivo-active pro-apoptotic agents. Part II: Structural and biological characterization. Bioorg Med Chem20:6709-23 (2012) 
 
E3 ubiquitin-protein ligase XIAP
Name:E3 ubiquitin-protein ligase XIAP
Type:Protein
Mol. Mass.:56685.27
Organism:Homo sapiens (Human)
Description:P98170
Residue:497
BDBM50401489
NameBDBM50401489
Synonyms:CHEMBL2204580
TypeSmall organic molecule
Emp. Form.C68H86N12O10
Mol. Mass.1231.4848
SMILESCC[C@H](NC)C(=O)N[C@H]1[C@@H](CNC(=O)CCNc2c(NCCC(=O)NC[C@H]3CC[C@H]4CC[C@H](N4C(=O)[C@H]3NC(=O)[C@H](CC)NC)C(=O)NC(c3ccccc3)c3ccccc3)c(=O)c2=O)CC[C@H]2CC[C@H](N2C1=O)C(=O)NC(c1ccccc1)c1ccccc1