Reaction Details
TargetE3 ubiquitin-protein ligase XIAP
LigandBDBM50401491
Substrate/Competitorn/a
Meas. Tech.ChEMBL_884123 (CHEMBL2216053)
IC50 25.4±n/a nM
Citation Lecis, DMastrangelo, EBelvisi, LBolognesi, MCivera, MCossu, FDe Cesare, MDelia, DDrago, CManenti, GManzoni, LMilani, MMoroni, EPerego, PPotenza, DRizzo, VScavullo, CScolastico, CServida, FVasile, FSeneci, P Dimeric Smac mimetics/IAP inhibitors as in vivo-active pro-apoptotic agents. Part II: Structural and biological characterization. Bioorg Med Chem20:6709-23 (2012) 
 
E3 ubiquitin-protein ligase XIAP
Name:E3 ubiquitin-protein ligase XIAP
Type:Protein
Mol. Mass.:56685.27
Organism:Homo sapiens (Human)
Description:P98170
Residue:497
BDBM50401491
NameBDBM50401491
Synonyms:CHEMBL2204581
TypeSmall organic molecule
Emp. Form.C64H88N14O8
Mol. Mass.1181.4725
SMILESCC[C@H](NC)C(=O)N[C@H]1[C@@H](CO)CC[C@H]2CC[C@H](N2C1=O)C(=O)N[C@H](c1cn(CCCCc2ccc(CCCCn3cc(nn3)[C@@H](NC(=O)[C@@H]3CC[C@@H]4CC[C@H](CO)[C@H](NC(=O)[C@H](CC)NC)C(=O)N34)c3ccccc3)cc2)nn1)c1ccccc1