Reaction Details
TargetE3 ubiquitin-protein ligase XIAP
LigandBDBM50401475
Substrate/Competitorn/a
Meas. Tech.ChEMBL_884123 (CHEMBL2216053)
IC50 24.5±n/a nM
Citation Lecis, DMastrangelo, EBelvisi, LBolognesi, MCivera, MCossu, FDe Cesare, MDelia, DDrago, CManenti, GManzoni, LMilani, MMoroni, EPerego, PPotenza, DRizzo, VScavullo, CScolastico, CServida, FVasile, FSeneci, P Dimeric Smac mimetics/IAP inhibitors as in vivo-active pro-apoptotic agents. Part II: Structural and biological characterization. Bioorg Med Chem20:6709-23 (2012) 
 
E3 ubiquitin-protein ligase XIAP
Name:E3 ubiquitin-protein ligase XIAP
Type:Protein
Mol. Mass.:56685.27
Organism:Homo sapiens (Human)
Description:P98170
Residue:497
BDBM50401475
NameBDBM50401475
Synonyms:CHEMBL2205248
TypeSmall organic molecule
Emp. Form.C62H86N12O12
Mol. Mass.1191.4194
SMILESCC[C@H](NC)C(=O)N[C@H]1[C@@H](CO)CC[C@H]2CC[C@H](N2C1=O)C(=O)N[C@H](C(=O)NCCNC(=O)CCC#CC#CCCC(=O)NCCNC(=O)[C@@H](NC(=O)[C@@H]1CC[C@@H]2CC[C@H](CO)[C@H](NC(=O)[C@H](CC)NC)C(=O)N12)c1ccccc1)c1ccccc1