Reaction Details
TargetLactoylglutathione lyase
LigandBDBM50402209
Substrate/Competitorn/a
Meas. Tech.ChEMBL_885082 (CHEMBL2212266)
IC50>10000±n/a nM
Citation Chiba, TOhwada, JSakamoto, HKobayashi, TFukami, TAIrie, MMiura, TOhara, KKoyano, H Design and evaluation of azaindole-substituted N-hydroxypyridones as glyoxalase I inhibitors. Bioorg Med Chem Lett22:7486-9 (2012) 
 
Lactoylglutathione lyase
Name:Lactoylglutathione lyase
Type:Enzyme
Mol. Mass.:20772.95
Organism:Homo sapiens (Human)
Description:Q04760
Residue:184
BDBM50402209
NameBDBM50402209
Synonyms:CHEMBL2203973
TypeSmall organic molecule
Emp. Form.C15H17NO2
Mol. Mass.243.301
SMILESCCCCc1cc(-c2ccccc2)n(O)c(=O)c1