Reaction Details
TargetLactoylglutathione lyase
LigandBDBM50402215
Substrate/Competitorn/a
Meas. Tech.ChEMBL_885082 (CHEMBL2212266)
IC50 1190±n/a nM
Citation Chiba, TOhwada, JSakamoto, HKobayashi, TFukami, TAIrie, MMiura, TOhara, KKoyano, H Design and evaluation of azaindole-substituted N-hydroxypyridones as glyoxalase I inhibitors. Bioorg Med Chem Lett22:7486-9 (2012) 
 
Lactoylglutathione lyase
Name:Lactoylglutathione lyase
Type:Enzyme
Mol. Mass.:20772.95
Organism:Homo sapiens (Human)
Description:Q04760
Residue:184
BDBM50402215
NameBDBM50402215
Synonyms:CHEMBL1624076
TypeSmall organic molecule
Emp. Form.C17H13NO2
Mol. Mass.263.2906
SMILESOn1c(cc(cc1=O)-c1ccccc1)-c1ccccc1