Reaction Details
TargetLeukotriene A-4 hydrolase
LigandBDBM50402387
Substrate/Competitorn/a
Meas. Tech.ChEMBL_886318 (CHEMBL2212808)
IC50 14±n/a nM
Citation Tanis, VMBacani, GMBlevitt, JMChrovian, CCCrawford, SDe Leon, AFourie, AMGomez, LGrice, CAHerman, KKearney, AMLandry-Bayle, AMLee-Dutra, ANelson, JRiley, JPSantillán, AWiener, JJXue, XYoung, AL Azabenzthiazole inhibitors of leukotriene A4 hydrolase. Bioorg Med Chem Lett22:7504-11 (2012) 
 
Leukotriene A-4 hydrolase
Name:Leukotriene A-4 hydrolase
Type:Hydrolase; metalloprotease
Mol. Mass.:69280.41
Organism:Homo sapiens (Human)
Description:Human recombinant LTA4H.
Residue:611
BDBM50402387
NameBDBM50402387
Synonyms:CHEMBL2207746
TypeSmall organic molecule
Emp. Form.C21H22N4O2S
Mol. Mass.394.49
SMILESCC(=O)N1CC2CC1CN2CCc1ccc(Oc2nc3ncccc3s2)cc1