Reaction Details
TargetLeukotriene A-4 hydrolase
LigandBDBM50402398
Substrate/Competitorn/a
Meas. Tech.ChEMBL_886318 (CHEMBL2212808)
IC50 29±n/a nM
Citation Tanis, VMBacani, GMBlevitt, JMChrovian, CCCrawford, SDe Leon, AFourie, AMGomez, LGrice, CAHerman, KKearney, AMLandry-Bayle, AMLee-Dutra, ANelson, JRiley, JPSantillán, AWiener, JJXue, XYoung, AL Azabenzthiazole inhibitors of leukotriene A4 hydrolase. Bioorg Med Chem Lett22:7504-11 (2012) 
 
Leukotriene A-4 hydrolase
Name:Leukotriene A-4 hydrolase
Type:Hydrolase; metalloprotease
Mol. Mass.:69280.41
Organism:Homo sapiens (Human)
Description:Human recombinant LTA4H.
Residue:611
BDBM50402398
NameBDBM50402398
Synonyms:CHEMBL2207735
TypeSmall organic molecule
Emp. Form.C18H18FN3OS
Mol. Mass.343.418
SMILESFc1cnc2nc(Oc3ccc(CN4CCCCC4)cc3)sc2c1