Reaction Details
TargetPotassium voltage-gated channel subfamily H member 2
LigandBDBM50402385
Substrate/Competitorn/a
Meas. Tech.ChEMBL_886196 (CHEMBL2210904)
IC50>10000±n/a nM
Citation Tanis, VMBacani, GMBlevitt, JMChrovian, CCCrawford, SDe Leon, AFourie, AMGomez, LGrice, CAHerman, KKearney, AMLandry-Bayle, AMLee-Dutra, ANelson, JRiley, JPSantillán, AWiener, JJXue, XYoung, AL Azabenzthiazole inhibitors of leukotriene A4 hydrolase. Bioorg Med Chem Lett22:7504-11 (2012) 
 
Potassium voltage-gated channel subfamily H member 2
Name:Potassium voltage-gated channel subfamily H member 2
Type:Multi-pass membrane protein
Mol. Mass.:126672.65
Organism:Homo sapiens (Human)
Description:Q12809
Residue:1159
BDBM50402385
NameBDBM50402385
Synonyms:CHEMBL2207748
TypeSmall organic molecule
Emp. Form.C22H24N4O2S
Mol. Mass.408.517
SMILESO=C1CCCN1C1CCN(Cc2ccc(Oc3nc4ncccc4s3)cc2)CC1