Reaction Details
TargetPotassium voltage-gated channel subfamily H member 2
LigandBDBM50402387
Substrate/Competitorn/a
Meas. Tech.ChEMBL_886196 (CHEMBL2210904)
IC50>10000±n/a nM
Citation Tanis, VMBacani, GMBlevitt, JMChrovian, CCCrawford, SDe Leon, AFourie, AMGomez, LGrice, CAHerman, KKearney, AMLandry-Bayle, AMLee-Dutra, ANelson, JRiley, JPSantillán, AWiener, JJXue, XYoung, AL Azabenzthiazole inhibitors of leukotriene A4 hydrolase. Bioorg Med Chem Lett22:7504-11 (2012) 
 
Potassium voltage-gated channel subfamily H member 2
Name:Potassium voltage-gated channel subfamily H member 2
Type:Multi-pass membrane protein
Mol. Mass.:126672.65
Organism:Homo sapiens (Human)
Description:Q12809
Residue:1159
BDBM50402387
NameBDBM50402387
Synonyms:CHEMBL2207746
TypeSmall organic molecule
Emp. Form.C21H22N4O2S
Mol. Mass.394.49
SMILESCC(=O)N1CC2CC1CN2CCc1ccc(Oc2nc3ncccc3s2)cc1