Reaction Details
TargetPotassium voltage-gated channel subfamily H member 2
LigandBDBM50402400
Substrate/Competitorn/a
Meas. Tech.ChEMBL_886196 (CHEMBL2210904)
IC50 8100±n/a nM
Citation Tanis, VMBacani, GMBlevitt, JMChrovian, CCCrawford, SDe Leon, AFourie, AMGomez, LGrice, CAHerman, KKearney, AMLandry-Bayle, AMLee-Dutra, ANelson, JRiley, JPSantillán, AWiener, JJXue, XYoung, AL Azabenzthiazole inhibitors of leukotriene A4 hydrolase. Bioorg Med Chem Lett22:7504-11 (2012) 
 
Potassium voltage-gated channel subfamily H member 2
Name:Potassium voltage-gated channel subfamily H member 2
Type:Multi-pass membrane protein
Mol. Mass.:126672.65
Organism:Homo sapiens (Human)
Description:Q12809
Residue:1159
BDBM50402400
NameBDBM50402400
Synonyms:CHEMBL2207733
TypeSmall organic molecule
Emp. Form.C19H21N3OS
Mol. Mass.339.455
SMILESCc1ccnc2nc(Oc3ccc(CN4CCCCC4)cc3)sc12