Reaction Details
TargetTyrosine-protein kinase JAK2
LigandBDBM50402430
Substrate/Competitorn/a
Meas. Tech.ChEMBL_886510 (CHEMBL2214785)
IC50>30000±n/a nM
Citation Forsyth, TKearney, PCKim, BGJohnson, HWAay, NArcalas, ABrown, DSChan, VChen, JDu, HEpshteyn, SGalan, AAHuynh, TPIbrahim, MAKane, BKoltun, ESMann, GMeyr, LELee, MSLewis, GLNoguchi, RTPack, MRidgway, BHShi, XTakeuchi, CSZu, PLeahy, JWNuss, JMAoyama, REngst, SGendreau, SBKassees, RLi, JLin, SHMartini, JFStout, TTong, PWoolfrey, JZhang, WYu, P SAR and in vivo evaluation of 4-aryl-2-aminoalkylpyrimidines as potent and selective Janus kinase 2 (JAK2) inhibitors. Bioorg Med Chem Lett22:7653-8 (2012) 
 
Tyrosine-protein kinase JAK2
Name:Tyrosine-protein kinase JAK2
Type:Protein
Mol. Mass.:130684.68
Organism:Homo sapiens (Human)
Description:O60674
Residue:1132
BDBM50402430
NameBDBM50402430
Synonyms:CHEMBL2207762
TypeSmall organic molecule
Emp. Form.C25H25Cl2N5O2
Mol. Mass.498.404
SMILESCC(=O)Nc1ccc(cc1)-c1ccnc(NC2CCCC(C2)NC(=O)c2c(Cl)cccc2Cl)n1