Reaction Details
TargetTyrosine-protein kinase JAK2
LigandBDBM50402411
Substrate/Competitorn/a
Meas. Tech.ChEMBL_886512 (CHEMBL2214787)
IC50 5.2±n/a nM
Citation Forsyth, TKearney, PCKim, BGJohnson, HWAay, NArcalas, ABrown, DSChan, VChen, JDu, HEpshteyn, SGalan, AAHuynh, TPIbrahim, MAKane, BKoltun, ESMann, GMeyr, LELee, MSLewis, GLNoguchi, RTPack, MRidgway, BHShi, XTakeuchi, CSZu, PLeahy, JWNuss, JMAoyama, REngst, SGendreau, SBKassees, RLi, JLin, SHMartini, JFStout, TTong, PWoolfrey, JZhang, WYu, P SAR and in vivo evaluation of 4-aryl-2-aminoalkylpyrimidines as potent and selective Janus kinase 2 (JAK2) inhibitors. Bioorg Med Chem Lett22:7653-8 (2012) 
 
Tyrosine-protein kinase JAK2
Name:Tyrosine-protein kinase JAK2
Type:Protein
Mol. Mass.:130684.68
Organism:Homo sapiens (Human)
Description:O60674
Residue:1132
BDBM50402411
NameBDBM50402411
Synonyms:CHEMBL2207759
TypeSmall organic molecule
Emp. Form.C26H30N6O2
Mol. Mass.458.5554
SMILESCN1CCC[C@@H]1C(=O)Nc1ccc(cc1)-c1ccnc(Nc2ccc(cc2)N2CCOCC2)n1