Reaction Details
TargetTyrosine-protein kinase JAK2
LigandBDBM50310998
Substrate/Competitorn/a
Meas. Tech.ChEMBL_886512 (CHEMBL2214787)
IC50 3.6±n/a nM
Citation Forsyth, TKearney, PCKim, BGJohnson, HWAay, NArcalas, ABrown, DSChan, VChen, JDu, HEpshteyn, SGalan, AAHuynh, TPIbrahim, MAKane, BKoltun, ESMann, GMeyr, LELee, MSLewis, GLNoguchi, RTPack, MRidgway, BHShi, XTakeuchi, CSZu, PLeahy, JWNuss, JMAoyama, REngst, SGendreau, SBKassees, RLi, JLin, SHMartini, JFStout, TTong, PWoolfrey, JZhang, WYu, P SAR and in vivo evaluation of 4-aryl-2-aminoalkylpyrimidines as potent and selective Janus kinase 2 (JAK2) inhibitors. Bioorg Med Chem Lett22:7653-8 (2012) 
 
Tyrosine-protein kinase JAK2
Name:Tyrosine-protein kinase JAK2
Type:Protein
Mol. Mass.:130684.68
Organism:Homo sapiens (Human)
Description:O60674
Residue:1132
BDBM50310998
NameBDBM50310998
Synonyms:CHEMBL1077458 | N-(4-(2-(4-morpholinophenylamino)pyrimidin-4-yl)phenyl)acetamide
TypeSmall organic molecule
Emp. Form.C22H23N5O2
Mol. Mass.389.4503
SMILESCC(=O)Nc1ccc(cc1)-c1ccnc(Nc2ccc(cc2)N2CCOCC2)n1