Reaction Details
TargetCannabinoid receptor 1
LigandBDBM50402864
Substrate/Competitorn/a
Meas. Tech.ChEMBL_885143 (CHEMBL2213234)
Ki 15100±n/a nM
Citation Thur, YBhalerao, AMunshi, ZPansare, NMann, KHanauer, GKley, HPNappe, SWeiss-Haljiti, COstermann, CZitt, CSchaefer, MMondal, DAli Siddiki, AArmugam, VGudaghe, VGupta, MRayudu, PDautzenberg, FMDas Sarma, K Structure-activity relationships of 2-arylamido-5,7-dihydro-4H-thieno[2,3-c]pyran-3-carboxamide derivatives as cannabinoid receptor agonists and their analgesic action. Bioorg Med Chem Lett22:7314-21 (2012) 
 
Cannabinoid receptor 1
Name:Cannabinoid receptor 1
Type:G Protein-Coupled Receptor (GPCR)
Mol. Mass.:52856.55
Organism:Rattus norvegicus (rat)
Description:P20272
Residue:473
BDBM50402864
NameBDBM50402864
Synonyms:CHEMBL2205615
TypeSmall organic molecule
Emp. Form.C21H21F3N2O3S
Mol. Mass.438.463
SMILESFC(F)(F)c1ccccc1C(=O)Nc1sc2COCCc2c1C(=O)N1CCCCC1