Reaction Details
TargetCannabinoid receptor 1
LigandBDBM50402858
Substrate/Competitorn/a
Meas. Tech.ChEMBL_885130 (CHEMBL2212764)
Ki>30000±n/a nM
Citation Thur, YBhalerao, AMunshi, ZPansare, NMann, KHanauer, GKley, HPNappe, SWeiss-Haljiti, COstermann, CZitt, CSchaefer, MMondal, DAli Siddiki, AArmugam, VGudaghe, VGupta, MRayudu, PDautzenberg, FMDas Sarma, K Structure-activity relationships of 2-arylamido-5,7-dihydro-4H-thieno[2,3-c]pyran-3-carboxamide derivatives as cannabinoid receptor agonists and their analgesic action. Bioorg Med Chem Lett22:7314-21 (2012) 
 
Cannabinoid receptor 1
Name:Cannabinoid receptor 1
Type:G Protein-Coupled Receptor (GPCR)
Mol. Mass.:52868.96
Organism:Homo sapiens (Human)
Description:P21554
Residue:472
BDBM50402858
NameBDBM50402858
Synonyms:CHEMBL2205592
TypeSmall organic molecule
Emp. Form.C19H15F5N2O4S
Mol. Mass.462.39
SMILESFC(F)(F)Oc1ccccc1C(=O)Nc1sc2COCCc2c1C(=O)N1CC(F)(F)C1