Reaction Details
TargetCannabinoid receptor 2
LigandBDBM50402869
Substrate/Competitorn/a
Meas. Tech.ChEMBL_885141 (CHEMBL2213232)
EC50 101±n/a nM
Citation Thur, YBhalerao, AMunshi, ZPansare, NMann, KHanauer, GKley, HPNappe, SWeiss-Haljiti, COstermann, CZitt, CSchaefer, MMondal, DAli Siddiki, AArmugam, VGudaghe, VGupta, MRayudu, PDautzenberg, FMDas Sarma, K Structure-activity relationships of 2-arylamido-5,7-dihydro-4H-thieno[2,3-c]pyran-3-carboxamide derivatives as cannabinoid receptor agonists and their analgesic action. Bioorg Med Chem Lett22:7314-21 (2012) 
 
Cannabinoid receptor 2
Name:Cannabinoid receptor 2
Type:G Protein-Coupled Receptor (GPCR)
Mol. Mass.:39690.94
Organism:Homo sapiens (Human)
Description:P34972
Residue:360
BDBM50402869
NameBDBM50402869
Synonyms:CHEMBL2205586
TypeSmall organic molecule
Emp. Form.C21H23F3N2O5S
Mol. Mass.472.478
SMILESCOCC(C)(C)NC(=O)c1c(NC(=O)c2ccccc2OC(F)(F)F)sc2COCCc12