Reaction Details
TargetCannabinoid receptor 1
LigandBDBM50402913
Substrate/Competitorn/a
Meas. Tech.ChEMBL_885135 (CHEMBL2212769)
EC50>10000±n/a nM
Citation Thur, YBhalerao, AMunshi, ZPansare, NMann, KHanauer, GKley, HPNappe, SWeiss-Haljiti, COstermann, CZitt, CSchaefer, MMondal, DAli Siddiki, AArmugam, VGudaghe, VGupta, MRayudu, PDautzenberg, FMDas Sarma, K Structure-activity relationships of 2-arylamido-5,7-dihydro-4H-thieno[2,3-c]pyran-3-carboxamide derivatives as cannabinoid receptor agonists and their analgesic action. Bioorg Med Chem Lett22:7314-21 (2012) 
 
Cannabinoid receptor 1
Name:Cannabinoid receptor 1
Type:G Protein-Coupled Receptor (GPCR)
Mol. Mass.:52868.96
Organism:Homo sapiens (Human)
Description:P21554
Residue:472
BDBM50402913
NameBDBM50402913
Synonyms:CHEMBL2204898
TypeSmall organic molecule
Emp. Form.C19H29N3O3S
Mol. Mass.379.517
SMILESCOCCNC(=O)c1c(NC(=O)CN2CCCCC2)sc2CCCCc12