Reaction Details
TargetCannabinoid receptor 1
LigandBDBM50402877
Substrate/Competitorn/a
Meas. Tech.ChEMBL_885135 (CHEMBL2212769)
EC50>10000±n/a nM
Citation Thur, YBhalerao, AMunshi, ZPansare, NMann, KHanauer, GKley, HPNappe, SWeiss-Haljiti, COstermann, CZitt, CSchaefer, MMondal, DAli Siddiki, AArmugam, VGudaghe, VGupta, MRayudu, PDautzenberg, FMDas Sarma, K Structure-activity relationships of 2-arylamido-5,7-dihydro-4H-thieno[2,3-c]pyran-3-carboxamide derivatives as cannabinoid receptor agonists and their analgesic action. Bioorg Med Chem Lett22:7314-21 (2012) 
 
Cannabinoid receptor 1
Name:Cannabinoid receptor 1
Type:G Protein-Coupled Receptor (GPCR)
Mol. Mass.:52868.96
Organism:Homo sapiens (Human)
Description:P21554
Residue:472
BDBM50402877
NameBDBM50402877
Synonyms:CHEMBL2205612
TypeSmall organic molecule
Emp. Form.C20H20F3NO3S
Mol. Mass.411.438
SMILESCC(C)(C)C(=O)c1c(NC(=O)c2ccccc2C(F)(F)F)sc2COCCc12