Reaction Details
TargetGag-Pol polyprotein [489-587]
LigandBDBM50403346
Substrate/Competitorn/a
Meas. Tech.ChEBML_157883
Ki 3700±n/a nM
Citation Thompson, SKEppley, AMFrazee, JSDarcy, MGLum, RTTomaszek, TAIvanoff, LAMorris, JFSternberg, EJLambert, DMFernandez, AVPetteway, SRMeek, TDMetcalf, BWGleason, JG Synthesis and antiviral activity of a novel class of HIV-1 protease inhibitors containing a heterocyclic P1-P2 amide bond isostere Bioorg Med Chem Lett4:2441-2446 (1994)    Article
 
Gag-Pol polyprotein [489-587]
Name:Gag-Pol polyprotein [489-587]
Type:Enzyme Subunit
Mol. Mass.:10781.16
Organism:Human immunodeficiency virus type 1
Description:P04585[489-587]
Residue:99
BDBM50403346
NameBDBM50403346
Synonyms:CHEMBL81775
TypeSmall organic molecule
Emp. Form.C29H36N2O4S
Mol. Mass.508.672
SMILESCCC(=O)c1cnc(s1)[C@@H](C[C@H](O)[C@H](Cc1ccccc1)NC(=O)OC(C)(C)C)Cc1ccccc1