Reaction Details
TargetATP synthase subunit beta,/delta,/epsilon,/gamma, mitochondrial
LigandBDBM50404289
Substrate/Competitorn/a
Meas. Tech.ChEMBL_65922 (CHEMBL678317)
IC50 430±n/a nM
Citation Atwal, KSAhmad, SDing, CZStein, PDLloyd, JHamann, LGGreen, DWFerrara, FNWang, PRogers, WLDoweyko, LMMiller, AVBisaha, SNSchmidt, JBLi, LYost, KJLan, HJMadsen, CS N-[1-Aryl-2-(1-imidazolo)ethyl]-guanidine derivatives as potent inhibitors of the bovine mitochondrial F1F0 ATP hydrolase. Bioorg Med Chem Lett14:1027-30 (2004) 
 
ATP synthase subunit beta,/delta,/epsilon,/gamma, mitochondrial
Name:ATP synthase subunit beta,/delta,/epsilon,/gamma, mitochondrial
Synonyms:Mitochondrial complex V; ATP synthase
Type:n/a
Mol. Mass.:n/a
Description:ASSAY_ID of EBI is 65924
Components:This complex has 4 components.
Component 1
Name:ATP synthase subunit epsilon, mitochondrial
Type:PROTEIN
Mol. Mass.:5790.87
Organism:Bos taurus
Description:EBI_100264
Residue:51
Component 2
Name:ATP synthase subunit beta, mitochondrial
Synonyms:ATP5B ATPB_BOVIN
Type:PROTEIN
Mol. Mass.:56271.25
Organism:Bos taurus
Description:EBI_100264
Residue:528
Component 3
Name:ATP synthase subunit gamma, mitochondrial
Synonyms:ATP5C ATP5F1C F-ATPase gamma subunit
Type:PROTEIN
Mol. Mass.:33081.70
Organism:Bos taurus
Description:ChEMBL_65923
Residue:298
Component 4
Name:ATP synthase subunit delta, mitochondrial
Synonyms:ATP5D ATPD_BOVIN | F-ATPase delta subunit
Type:PROTEIN
Mol. Mass.:17608.84
Organism:Bos taurus
Description:EBI_100264
Residue:168
BDBM50404289
NameBDBM50404289
Synonyms:CHEMBL8376
TypeSmall organic molecule
Emp. Form.C18H14Cl3N3OS
Mol. Mass.426.747
SMILESClc1ccc(NC(=S)OC(Cn2ccnc2)c2ccc(Cl)cc2Cl)cc1