Reaction Details
TargetGastrin/cholecystokinin type B receptor
LigandBDBM50410551
Substrate/Competitorn/a
Meas. Tech.ChEMBL_321686 (CHEMBL872181)
IC50 40±n/a nM
Citation Buck, IMBlack, JWCooke, TDunstone, DJGaffen, JDGriffin, EPHarper, EAHull, RAKalindjian, SBLilley, EJLinney, IDLow, CMMcDonald, IMPether, MJRoberts, SPShankley, NPShaxted, MESteel, KISykes, DATozer, MJWatt, GFWalker, MKWright, LWright, PT Optimization of the in vitro and in vivo properties of a novel series of 2,4,5-trisubstituted imidazoles as potent cholecystokinin-2 (CCK2) antagonists. J Med Chem48:6803-12 (2005) 
 
Gastrin/cholecystokinin type B receptor
Name:Gastrin/cholecystokinin type B receptor
Type:Enzyme Catalytic Domain
Mol. Mass.:48544.19
Organism:Dog
Description:Cholecystokinin B 0 Dog::P30552
Residue:453
BDBM50410551
NameBDBM50410551
Synonyms:CHEMBL195007
TypeSmall organic molecule
Emp. Form.C33H39N3O3
Mol. Mass.525.6811
SMILESCc1cc(C)c(-c2nc(CCC34CC5CC(CC(C5)C3)C4)c([nH]2)C(=O)Nc2ccc(C)c(c2)C(O)=O)c(C)c1