Reaction Details
TargetHistidine-rich protein PFHRP-II
LigandBDBM50015214
Substrate/Competitorn/a
Meas. Tech.ChEMBL_426926 (CHEMBL909252)
IC50 292000±n/a nM
Citation Huy, NTUyen, DTMaeda, ATrang, DTOida, THarada, SKamei, K Simple colorimetric inhibition assay of heme crystallization for high-throughput screening of antimalarial compounds. Antimicrob Agents Chemother51:350-3 (2006) 
 
Histidine-rich protein PFHRP-II
Name:Histidine-rich protein PFHRP-II
Type:PROTEIN
Mol. Mass.:35156.49
Organism:Plasmodium falciparum
Description:ChEMBL_500704
Residue:332
BDBM50015214
NameBDBM50015214
Synonyms:6-chloro-2-methoxy-9-acridinyl(4-diethylamino-1-methylbutyl)amine CHEMBL7568 N*4*-(6-Chloro-2-methoxy-acridin-9-yl)-N*1*,N*1*-diethyl-pentane-1,4-diamine N*4*-(6-Chloro-2-methoxy-acridin-9-yl)-N*1*,N*1*-diethyl-pentane-1,4-diamine ; (mepacrine) cid_237 | quinacrine
TypeSmall organic molecule
Emp. Form.C23H30ClN3O
Mol. Mass.399.957
SMILESCCN(CC)CCCC(C)Nc1c2ccc(Cl)cc2nc2ccc(OC)cc12