Reaction Details
TargetCyclin-dependent kinase 2
LigandBDBM86638
Substrate/Competitorn/a
Meas. Tech.ChEMBL_446774 (CHEMBL897074)
IC50>10000±n/a nM
Citation Angell, RMAtkinson, FLBrown, MJChuang, TTChristopher, JACichy-Knight, MDunn, AKHightower, KEMalkakorpi, SMusgrave, JRNeu, MRowland, PShea, RLSmith, JLSomers, DOThomas, SAThompson, GWang, R N-(3-Cyano-4,5,6,7-tetrahydro-1-benzothien-2-yl)amides as potent, selective, inhibitors of JNK2 and JNK3. Bioorg Med Chem Lett17:1296-301 (2007) 
 
Cyclin-dependent kinase 2
Name:Cyclin-dependent kinase 2
Type:Enzyme Subunit
Mol. Mass.:33938.17
Organism:Homo sapiens (Human)
Description:P24941
Residue:298
BDBM86638
NameBDBM86638
Synonyms:n/a
TypeSmall organic molecule
Emp. Form.C20H16N2OS
Mol. Mass.332.419
SMILESO=C(Nc1sc2CCCCc2c1C#N)c1cccc2ccccc12