Reaction Details
TargetMacrophage colony-stimulating factor 1 receptor
LigandBDBM50411406
Substrate/Competitorn/a
Meas. Tech.ChEMBL_446773 (CHEMBL897073)
IC50>10000±n/a nM
Citation Angell, RMAtkinson, FLBrown, MJChuang, TTChristopher, JACichy-Knight, MDunn, AKHightower, KEMalkakorpi, SMusgrave, JRNeu, MRowland, PShea, RLSmith, JLSomers, DOThomas, SAThompson, GWang, R N-(3-Cyano-4,5,6,7-tetrahydro-1-benzothien-2-yl)amides as potent, selective, inhibitors of JNK2 and JNK3. Bioorg Med Chem Lett17:1296-301 (2007) 
 
Macrophage colony-stimulating factor 1 receptor
Name:Macrophage colony-stimulating factor 1 receptor
Type:Protein
Mol. Mass.:107979.48
Organism:Homo sapiens (Human)
Description:P07333
Residue:972
BDBM50411406
NameBDBM50411406
Synonyms:CHEMBL232601
TypeSmall organic molecule
Emp. Form.C23H19N3O2S
Mol. Mass.401.481
SMILESO=C(Nc1sc2N(CCCc2c1C#N)C(=O)C1CC1)c1cccc2ccccc12