Reaction Details
TargetEpidermal growth factor receptor
LigandBDBM86638
Substrate/Competitorn/a
Meas. Tech.ChEMBL_446775 (CHEMBL897075)
IC50>10000±n/a nM
Citation Angell, RMAtkinson, FLBrown, MJChuang, TTChristopher, JACichy-Knight, MDunn, AKHightower, KEMalkakorpi, SMusgrave, JRNeu, MRowland, PShea, RLSmith, JLSomers, DOThomas, SAThompson, GWang, R N-(3-Cyano-4,5,6,7-tetrahydro-1-benzothien-2-yl)amides as potent, selective, inhibitors of JNK2 and JNK3. Bioorg Med Chem Lett17:1296-301 (2007) 
 
Epidermal growth factor receptor
Name:Epidermal growth factor receptor
Type:Receptor Kinase Domain
Mol. Mass.:134279.59
Organism:Homo sapiens (Human)
Description:P00533
Residue:1210
BDBM86638
NameBDBM86638
Synonyms:n/a
TypeSmall organic molecule
Emp. Form.C20H16N2OS
Mol. Mass.332.419
SMILESO=C(Nc1sc2CCCCc2c1C#N)c1cccc2ccccc12