Reaction Details
TargetMitogen-activated protein kinase 14
LigandBDBM50411405
Substrate/Competitorn/a
Meas. Tech.ChEMBL_446770 (CHEMBL897069)
IC50>15848.93±n/a nM
Citation Angell, RMAtkinson, FLBrown, MJChuang, TTChristopher, JACichy-Knight, MDunn, AKHightower, KEMalkakorpi, SMusgrave, JRNeu, MRowland, PShea, RLSmith, JLSomers, DOThomas, SAThompson, GWang, R N-(3-Cyano-4,5,6,7-tetrahydro-1-benzothien-2-yl)amides as potent, selective, inhibitors of JNK2 and JNK3. Bioorg Med Chem Lett17:1296-301 (2007) 
 
Mitogen-activated protein kinase 14
Name:Mitogen-activated protein kinase 14
Type:Serine/threonine-protein kinase
Mol. Mass.:41286.76
Organism:Homo sapiens (Human)
Description:Q16539
Residue:360
BDBM50411405
NameBDBM50411405
Synonyms:CHEMBL233794
TypeSmall organic molecule
Emp. Form.C25H19N3O3S2
Mol. Mass.473.567
SMILESO=C(Nc1sc2N(CCCc2c1C#N)S(=O)(=O)c1ccccc1)c1cccc2ccccc12