Reaction Details
TargetD(3) dopamine receptor
LigandBDBM50411678
Substrate/Competitorn/a
Meas. Tech.ChEMBL_465003 (CHEMBL948180)
Ki 1.58±n/a nM
Citation Micheli, FBonanomi, GBraggio, SCapelli, AMCelestini, PDamiani, FDi Fabio, RDonati, DGagliardi, SGentile, GHamprecht, DPetrone, MRadaelli, STedesco, GTerreni, SWorby, AHeidbreder, C New fused benzazepine as selective D3 receptor antagonists. Synthesis and biological evaluation. Part one: [h]-fused tricyclic systems. Bioorg Med Chem Lett18:901-7 (2008) 
 
D(3) dopamine receptor
Name:D(3) dopamine receptor
Type:n/a
Mol. Mass.:44243.43
Organism:Homo sapiens (Human)
Description:n/a
Residue:400
BDBM50411678
NameBDBM50411678
Synonyms:CHEMBL273199
TypeSmall organic molecule
Emp. Form.C31H35N7S
Mol. Mass.537.722
SMILESCc1cc(-c2ccc3CCN(CCCSc4nnc(-c5cccc6cnc(C)cc56)n4C)CCc3c2)n(C)n1