Reaction Details
TargetD(3) dopamine receptor
LigandBDBM50411692
Substrate/Competitorn/a
Meas. Tech.ChEMBL_465003 (CHEMBL948180)
Ki 3.98±n/a nM
Citation Micheli, FBonanomi, GBraggio, SCapelli, AMCelestini, PDamiani, FDi Fabio, RDonati, DGagliardi, SGentile, GHamprecht, DPetrone, MRadaelli, STedesco, GTerreni, SWorby, AHeidbreder, C New fused benzazepine as selective D3 receptor antagonists. Synthesis and biological evaluation. Part one: [h]-fused tricyclic systems. Bioorg Med Chem Lett18:901-7 (2008) 
 
D(3) dopamine receptor
Name:D(3) dopamine receptor
Type:n/a
Mol. Mass.:44243.43
Organism:Homo sapiens (Human)
Description:n/a
Residue:400
BDBM50411692
NameBDBM50411692
Synonyms:CHEMBL401728
TypeSmall organic molecule
Emp. Form.C26H30N8O2S
Mol. Mass.518.634
SMILESCc1cc(-c2nc3cc4CCN(CCCSc5nnc(-c6ocnc6C)n5C)CCc4cc3o2)n(C)n1