Reaction Details
TargetHistamine H1 receptor
LigandBDBM50411716
Substrate/Competitorn/a
Meas. Tech.ChEMBL_465005 (CHEMBL948182)
Ki>5011.87±n/a nM
Citation Micheli, FBonanomi, GBraggio, SCapelli, AMCelestini, PDamiani, FDi Fabio, RDonati, DGagliardi, SGentile, GHamprecht, DPetrone, MRadaelli, STedesco, GTerreni, SWorby, AHeidbreder, C New fused benzazepine as selective D3 receptor antagonists. Synthesis and biological evaluation. Part one: [h]-fused tricyclic systems. Bioorg Med Chem Lett18:901-7 (2008) 
 
Histamine H1 receptor
Name:Histamine H1 receptor
Type:G Protein-Coupled Receptor (GPCR)
Mol. Mass.:55808.72
Organism:Homo sapiens (Human)
Description:Cell pellets from SK-N-MC cells transfected with human H1 receptor were used in binding assay.
Residue:487
BDBM50411716
NameBDBM50411716
Synonyms:CHEMBL429132
TypeSmall organic molecule
Emp. Form.C31H36N6OS
Mol. Mass.540.722
SMILESCc1ccc2c(cccc2n1)-c1nnc(SCCCN2CCc3cc4nc(oc4cc3CC2)C(C)(C)C)n1C