Reaction Details
TargetD(3) dopamine receptor
LigandBDBM50411641
Substrate/Competitorn/a
Meas. Tech.ChEMBL_465003 (CHEMBL948180)
Ki 25.12±n/a nM
Citation Micheli, FBonanomi, GBraggio, SCapelli, AMCelestini, PDamiani, FDi Fabio, RDonati, DGagliardi, SGentile, GHamprecht, DPetrone, MRadaelli, STedesco, GTerreni, SWorby, AHeidbreder, C New fused benzazepine as selective D3 receptor antagonists. Synthesis and biological evaluation. Part one: [h]-fused tricyclic systems. Bioorg Med Chem Lett18:901-7 (2008) 
 
D(3) dopamine receptor
Name:D(3) dopamine receptor
Type:n/a
Mol. Mass.:44243.43
Organism:Homo sapiens (Human)
Description:n/a
Residue:400
BDBM50411641
NameBDBM50411641
Synonyms:CHEMBL256651
TypeSmall organic molecule
Emp. Form.C25H27F2N5OS
Mol. Mass.483.577
SMILESCCc1nc2cc3CCN(CCCSc4nnc(-c5ccc(F)c(F)c5)n4C)CCc3cc2o1