Reaction Details
TargetD(3) dopamine receptor
LigandBDBM50411715
Substrate/Competitorn/a
Meas. Tech.ChEMBL_465003 (CHEMBL948180)
Ki 25.12±n/a nM
Citation Micheli, FBonanomi, GBraggio, SCapelli, AMCelestini, PDamiani, FDi Fabio, RDonati, DGagliardi, SGentile, GHamprecht, DPetrone, MRadaelli, STedesco, GTerreni, SWorby, AHeidbreder, C New fused benzazepine as selective D3 receptor antagonists. Synthesis and biological evaluation. Part one: [h]-fused tricyclic systems. Bioorg Med Chem Lett18:901-7 (2008) 
 
D(3) dopamine receptor
Name:D(3) dopamine receptor
Type:n/a
Mol. Mass.:44243.43
Organism:Homo sapiens (Human)
Description:n/a
Residue:400
BDBM50411715
NameBDBM50411715
Synonyms:CHEMBL439065
TypeSmall organic molecule
Emp. Form.C25H26F3N5OS
Mol. Mass.501.567
SMILESCc1nc2cc3CCN(CCCSc4nnc(-c5ccc(cc5)C(F)(F)F)n4C)CCc3cc2o1