Reaction Details
TargetPotassium voltage-gated channel subfamily H member 2
LigandBDBM50411692
Substrate/Competitorn/a
Meas. Tech.ChEMBL_465006 (CHEMBL948183)
IC50 1000±n/a nM
Citation Micheli, FBonanomi, GBraggio, SCapelli, AMCelestini, PDamiani, FDi Fabio, RDonati, DGagliardi, SGentile, GHamprecht, DPetrone, MRadaelli, STedesco, GTerreni, SWorby, AHeidbreder, C New fused benzazepine as selective D3 receptor antagonists. Synthesis and biological evaluation. Part one: [h]-fused tricyclic systems. Bioorg Med Chem Lett18:901-7 (2008) 
 
Potassium voltage-gated channel subfamily H member 2
Name:Potassium voltage-gated channel subfamily H member 2
Type:Multi-pass membrane protein
Mol. Mass.:126672.65
Organism:Homo sapiens (Human)
Description:Q12809
Residue:1159
BDBM50411692
NameBDBM50411692
Synonyms:CHEMBL401728
TypeSmall organic molecule
Emp. Form.C26H30N8O2S
Mol. Mass.518.634
SMILESCc1cc(-c2nc3cc4CCN(CCCSc5nnc(-c6ocnc6C)n5C)CCc4cc3o2)n(C)n1