Reaction Details
TargetHistamine H1 receptor
LigandBDBM50411672
Substrate/Competitorn/a
Meas. Tech.ChEMBL_465005 (CHEMBL948182)
Ki 630.96±n/a nM
Citation Micheli, FBonanomi, GBraggio, SCapelli, AMCelestini, PDamiani, FDi Fabio, RDonati, DGagliardi, SGentile, GHamprecht, DPetrone, MRadaelli, STedesco, GTerreni, SWorby, AHeidbreder, C New fused benzazepine as selective D3 receptor antagonists. Synthesis and biological evaluation. Part one: [h]-fused tricyclic systems. Bioorg Med Chem Lett18:901-7 (2008) 
 
Histamine H1 receptor
Name:Histamine H1 receptor
Type:G Protein-Coupled Receptor (GPCR)
Mol. Mass.:55808.72
Organism:Homo sapiens (Human)
Description:Cell pellets from SK-N-MC cells transfected with human H1 receptor were used in binding assay.
Residue:487
BDBM50411672
NameBDBM50411672
Synonyms:CHEMBL256477
TypeSmall organic molecule
Emp. Form.C30H35N7S
Mol. Mass.525.711
SMILESCCc1nn(C)c2cc3CCN(CCCSc4nnc(-c5cccc6nc(C)ccc56)n4C)CCc3cc12