Reaction Details
TargetD(3) dopamine receptor
LigandBDBM50411719
Substrate/Competitorn/a
Meas. Tech.ChEMBL_465003 (CHEMBL948180)
Ki 25.12±n/a nM
Citation Micheli, FBonanomi, GBraggio, SCapelli, AMCelestini, PDamiani, FDi Fabio, RDonati, DGagliardi, SGentile, GHamprecht, DPetrone, MRadaelli, STedesco, GTerreni, SWorby, AHeidbreder, C New fused benzazepine as selective D3 receptor antagonists. Synthesis and biological evaluation. Part one: [h]-fused tricyclic systems. Bioorg Med Chem Lett18:901-7 (2008) 
 
D(3) dopamine receptor
Name:D(3) dopamine receptor
Type:n/a
Mol. Mass.:44243.43
Organism:Homo sapiens (Human)
Description:n/a
Residue:400
BDBM50411719
NameBDBM50411719
Synonyms:CHEMBL269994
TypeSmall organic molecule
Emp. Form.C31H36N6OS
Mol. Mass.540.722
SMILESCCc1nc2cc3CCN(CCCCSc4nnc(-c5cccc6nc(C)ccc56)n4C)CCc3c(C)c2o1