Reaction Details
TargetcAMP-specific 3',5'-cyclic phosphodiesterase 4B
LigandBDBM50412402
Substrate/Competitorn/a
Meas. Tech.ChEMBL_492193 (CHEMBL951569)
IC50 100±n/a nM
Citation Hamblin, JNAngell, TDBallantine, SPCook, CMCooper, AWDawson, JDelves, CJJones, PSLindvall, MLucas, FSMitchell, CJNeu, MYRanshaw, LESolanke, YESomers, DOWiseman, JO Pyrazolopyridines as a novel structural class of potent and selective PDE4 inhibitors. Bioorg Med Chem Lett18:4237-41 (2008) 
 
cAMP-specific 3',5'-cyclic phosphodiesterase 4B
Name:cAMP-specific 3',5'-cyclic phosphodiesterase 4B
Type:Protein
Mol. Mass.:83318.87
Organism:Homo sapiens (Human)
Description:Q07343
Residue:736
BDBM50412402
NameBDBM50412402
Synonyms:CHEMBL488487
TypeSmall organic molecule
Emp. Form.C17H24N4O3
Mol. Mass.332.3975
SMILESCCCn1ncc2c(NC3CCOCC3)c(cnc12)C(=O)OCC