Reaction Details
TargetcAMP-specific 3',5'-cyclic phosphodiesterase 4B
LigandBDBM50412409
Substrate/Competitorn/a
Meas. Tech.ChEMBL_492193 (CHEMBL951569)
IC50 158.49±n/a nM
Citation Hamblin, JNAngell, TDBallantine, SPCook, CMCooper, AWDawson, JDelves, CJJones, PSLindvall, MLucas, FSMitchell, CJNeu, MYRanshaw, LESolanke, YESomers, DOWiseman, JO Pyrazolopyridines as a novel structural class of potent and selective PDE4 inhibitors. Bioorg Med Chem Lett18:4237-41 (2008) 
 
cAMP-specific 3',5'-cyclic phosphodiesterase 4B
Name:cAMP-specific 3',5'-cyclic phosphodiesterase 4B
Type:Protein
Mol. Mass.:83318.87
Organism:Homo sapiens (Human)
Description:Q07343
Residue:736
BDBM50412409
NameBDBM50412409
Synonyms:CHEMBL528771
TypeSmall organic molecule
Emp. Form.C18H25N5O2
Mol. Mass.343.4234
SMILESCCn1ncc2c(NC3CCOCC3)c(cnc12)C(=O)N1CCCC1