Reaction Details
TargetUrotensin-2 receptor
LigandBDBM50413760
Substrate/Competitorn/a
Meas. Tech.ChEMBL_523640 (CHEMBL998011)
Ki 0.251±n/a nM
Citation Grieco, PCarotenuto, ACampiglia, PGomez-Monterrey, IAuriemma, LSala, MMarcozzi, Cd'Emmanuele di Villa Bianca, RBrancaccio, DRovero, PSanticioli, PMeini, SMaggi, CANovellino, E New insight into the binding mode of peptide ligands at Urotensin-II receptor: structure-activity relationships study on P5U and urantide. J Med Chem52:3927-40 (2009) 
 
Urotensin-2 receptor
Name:Urotensin-2 receptor
Type:Enzyme Catalytic Domain
Mol. Mass.:42159.71
Organism:Homo sapiens (Human)
Description:Urotensin-II UTS2R HUMAN::Q9UKP6
Residue:389
BDBM50413760
NameBDBM50413760
Synonyms:CHEMBL426020
TypeSmall organic molecule
Emp. Form.C50H64N10O12S2
Mol. Mass.1061.233
SMILESCC(C)[C@H](NC(=O)[C@@H]1CSSC[C@@H](NC(=O)[C@@H](N)CC(O)=O)C(=O)N[C@@H](Cc2ccccc2)C(=O)N[C@@H](Cc2c[nH]c3ccccc23)C(=O)N[C@@H](CCCCN)C(=O)N[C@@H](Cc2ccc(O)cc2)C(=O)N1)C(O)=O