Reaction Details
TargetUrotensin-2
LigandBDBM50414757
Substrate/Competitorn/a
Meas. Tech.ChEMBL_588520 (CHEMBL1041260)
EC50 741.31±n/a nM
Citation Lehmann, FCurrier, EAClemons, BHansen, LKOlsson, RHacksell, ULuthman, K Novel and potent small-molecule urotensin II receptor agonists. Bioorg Med Chem17:4657-65 (2009) 
 
Urotensin-2
Name:Urotensin-2
Type:PROTEIN
Mol. Mass.:14297.49
Organism:Homo sapiens (Human)
Description:ChEMBL_643307
Residue:124
BDBM50414757
NameBDBM50414757
Synonyms:CHEMBL572454
TypeSmall organic molecule
Emp. Form.C24H28N2O2
Mol. Mass.376.4913
SMILESCO[C@@H](C(=O)N[C@@H](CCN(C)C)c1ccc2ccccc2c1)c1ccccc1